{"text_format":"2","workbook":"xlsx","n_sheets":28,"sheets":["Dairy Wizard","Data entry","Operating costs","Capital costs","Options","Data entry (3)","Operating costs (3)","Capital costs (3)","Options (2)","Report","Data entry (4)","Livestock","Slurry report","Rainfall","Markers","Effect on profit","Data entry (2)","Operating costs (2)","Capital costs (2)","Cubicle v straw","New cubicle","Cubicle + slats","Scrapers","Flushing","Light","Sand","Mattress","Mat"],"not_rendered":{"charts":0,"images":169,"macros":1,"external_links":0,"defined_names":80,"comments":3,"pivot_tables":0},"unopened":[],"bounds":{"document_bytes":16777216,"sheet_cells":100000,"run_cost":"one","rows_first":2000,"rows_last":500,"rows_between":2000,"halvings":0,"cell_chars":16384,"cell_head_chars":4096},"cells_cut":0,"cells_raw":0,"read":"whole","date_system":"1900"}

{"sheet":"Dairy Wizard","index":0,"n_rows":12,"n_cols":2,"rows_kept":12,"cut":false,"hidden":false,"merged":[]}
["Parlour Wizard"]
["Data entry"]
["Farm name/reference"]
["Herd size"]
["Milk yield/cow"]
["Depreciation buildings",5]
["Depreciation plant",10]
["Interest rate",5]
["Electricity cost",10]
["Water cost",1]
{"$rows_left_out":3}
{"sheet":"Data entry","index":1,"n_rows":25,"n_cols":4,"rows_kept":25,"cut":false,"hidden":false,"merged":[]}
["Housing Data entry"]
[]
[]
["Planned investment",100000]
[]
["Cow number for new house",100]
["Annual yield/cow",7000]
["Housing period ",200,null,{"$f":"366-B8","v":166}]
["Period of heat stress",0]
["Depreciation buildings",{"$f":"'Dairy Wizard'!B6","v":5}]
{"$rows_left_out":16}
{"sheet":"Operating costs","index":2,"n_rows":95,"n_cols":7,"rows_kept":95,"cut":false,"hidden":false,"merged":[[51,1,51,6]]}
["OPERATING COSTS"]
[]
[]
["BEDDING REQUIREMENTS"]
[]
["Straw unchopped yard",15,"kg/cow/day"]
["Straw chopped yard",10,"kg/cow/day"]
["Straw unchopped cubicle",7,"kg/cow/day"]
["Straw chopped cubicle",5,"kg/cow/day"]
["Straw chopped cubicle/mat",3,"kg/cow/day"]
{"$rows_left_out":86}
{"sheet":"Capital costs","index":3,"n_rows":64,"n_cols":5,"rows_kept":64,"cut":false,"hidden":false,"merged":[]}
["CAPITAL COSTS"]
[]
[]
[]
["Housing only","Cost £/sq.metre","Sq.metre/cow","£/cow"]
["Straw yard",125,10.5,{"$f":"B6*C6","v":1312.5}]
["Kennel 2 row",95,4.5999999999999996,{"$f":"(B7*C7)-50","v":386.99999999999994},"Excludes concrete base for cubicle - select below"]
["Cubicle 2 row excl. bed",175,4.5999999999999996,804.99999999999989,"Excludes concrete base for cubicle - select below"]
["Cubicle 2 row with slats",355,4.5999999999999996,1632.9999999999998,"Excludes concrete base for cubicle - select below"]
["Kennel 6 row",95,5.2,{"$f":"(B10*C10)-50","v":444},"Excludes concrete base for cubicle - select below"]
{"$rows_left_out":55}
{"sheet":"Options","index":4,"n_rows":38,"n_cols":11,"rows_kept":38,"cut":false,"hidden":false,"merged":[]}
[null,"NEW HOUSING OPTIONS"]
[]
[]
[]
[]
[null,"Bedding Method"]
[{"$nulls":8},"If ticked then brings in slurry cost below"]
[]
[{"$nulls":8},"Milk sales/annum",null,{"$f":"'Data entry'!B6*'Data entry'!B7","v":700000}]
[null,"Building options",null,null,"                     Operating     costs      £/annum"]
{"$rows_left_out":29}
{"sheet":"Data entry (3)","index":5,"n_rows":30,"n_cols":5,"rows_kept":30,"cut":false,"hidden":false,"merged":[[23,1,23,2]]}
["Parlour Wizard ~ existing parlour data entry"]
[]
[]
[]
[]
["Parlour type"]
["Number of units",10]
["Number of standings",{"$f":"IF(EXParl=\"herringbone 1:2\",B7*2,B7)","v":20}]
["Cows in milk"]
["Number of milking groups"]
{"$rows_left_out":14}
{"sheet":"Operating costs (3)","index":6,"n_rows":103,"n_cols":7,"rows_kept":103,"cut":false,"hidden":false,"merged":[]}
["Parlour Wizard operating costs"]
[]
[]
["Operations in seconds","1:1 herr.","1:2 herr","Int.rotary","Ext.rotary","Rapid exit","AutoTandem"]
["Marshalling",10,10,10,10,10,10]
["Loading cows in","varies","varies",1,0,"varies",15]
["In parlour feeding manual",3,3,3,3,0,3]
["In parlour feeding semi auto",1,1,1,1,0,1]
["In parlour feeding auto",0,0,0,0,0,0]
["Pre-dip",4,4,4,4,4,4]
{"$rows_left_out":56}
{"sheet":"Capital costs (3)","index":7,"n_rows":45,"n_cols":3,"rows_kept":45,"cut":false,"hidden":false,"merged":[]}
["Parlour Wizard Capital Costs"]
[]
[]
["Parlour equipment costs"]
["Herringbone 1:1",1800,"£/standing"]
["Herringbone 1:2",1700,"£/standing"]
["Rapid exit",2800,"£/standing"]
["Auto tandem",7000,"£/standing"]
["Internal rotary",3250,"£/standing"]
["External rotary",3250,"£/standing"]
{"$rows_left_out":36}
{"sheet":"Options (2)","index":8,"n_rows":36,"n_cols":22,"rows_kept":36,"cut":false,"hidden":false,"merged":[[27,0,28,2],[8,10,8,11],[9,10,9,11],[10,10,11,11]]}
["Planned Parlour Options"]
[]
[]
[]
["Data entry ",null,null,null,"Investment required"]
[]
["Planned herd size"]
["Planned cows in milk",{"$nulls":5},"Capacity"]
["Planned yield",{"$nulls":9},"Total Cost"]
["Planned annual litres",{"$f":"herd*B9","v":0},{"$nulls":8},{"$f":"Report!E14","v":0}]
{"$rows_left_out":20}
{"sheet":"Report","index":9,"n_rows":22,"n_cols":11,"rows_kept":22,"cut":false,"hidden":false,"merged":[[0,0,0,4]]}
[{"$f":"CONCATENATE(\"Financial Report \",\"for \", VLOOKUP(TRUE,parlourtype,2,FALSE),\" Parlour Option\")","v":"Financial Report for Herringbone 1:1 Parlour Option"}]
[]
[]
[{"$nulls":5},"                     Operating     costs      £/annum"]
[null,null,null,"Cost £/cow","£ total","Interest","Depreciation","Labour","Other","Total","p/litre"]
[{"$f":"IF('Options (2)'!H8>=25000,\"Dairy building with silo\",\"Dairy Building for bulk tank\")","v":"Dairy Building for bulk tank"},{"$f":"IF(Markers!H36=TRUE,\"Yes\",\"No\")","v":"No"},null,{"$f":"IF(B6=\"yes\",VLOOKUP(A6,buildingcosts,2,FALSE),\"\")","v":""},{"$f":"IF(B6=\"yes\",(VLOOKUP(A6,buildingcosts,2,FALSE))*herd,\"\")","v":""},{"$f":"IF(ISNUMBER(E6),$E6*'Dairy Wizard'!$B$8%,\"\")","v":""},{"$f":"IF(ISNUMBER(F6),$E6*'Dairy Wizard'!$B$6%,\"\")","v":""},null,null,{"$f":"IF(B6=\"yes\",SUM(F6:I6),\"\")","v":""},{"$f":"IF(B6=\"yes\",J6*100/annuallitres,\"\")","v":""}]
[{"$f":"IF(B7=\"yes\",IF('Options (2)'!H8>=25000,\"Milk silo\",IF('Options (2)'!H8>=10001,\"Bulk tank > 10000\",\"Bulk tank < 10000\")),\"Bulk tank/Milk silo\")","v":"Bulk tank/Milk silo"},{"$f":"IF(Markers!H37=TRUE,\"Yes\",\"No\")","v":"No"},null,{"$f":"IF(B7=\"yes\",E7/herd,\"\")","v":""},{"$f":"IF(B7=\"yes\",VLOOKUP(A7,equipcosts,2,FALSE)*'Options (2)'!H8,\"\")","v":""},{"$f":"IF(ISNUMBER(E7),$E7*'Dairy Wizard'!$B$8%,\"\")","v":""},{"$f":"IF(ISNUMBER(F7),$E7*'Dairy Wizard'!$B$7%,\"\")","v":""},null,null,"",""]
["Collecting yard",{"$f":"IF(Markers!H38=TRUE,\"Yes\",\"No\")","v":"No"},null,{"$f":"IF(B8=\"yes\",VLOOKUP(A8,buildingcosts,2,FALSE),\"\")","v":""},{"$f":"IF(B8=\"Yes\",VLOOKUP(A8,buildingcosts,2,FALSE)*herd,\"\")","v":""},{"$f":"IF(ISNUMBER(E8),$E8*'Dairy Wizard'!$B$8%,\"\")","v":""},{"$f":"IF(ISNUMBER(F8),$E8*'Dairy Wizard'!$B$6%,\"\")","v":""},null,null,"",""]
["AI stalls",{"$f":"IF(Markers!H39=TRUE,\"Yes\",\"No\")","v":"No"},null,{"$f":"IF(B9=\"yes\",E9/herd,\"\")","v":""},{"$f":"IF(B9=\"yes\",(VLOOKUP(A9,buildingcosts,2,FALSE)+'Capital costs (3)'!B45)*herd,\"\")","v":""},{"$f":"IF(ISNUMBER(E9),$E9*'Dairy Wizard'!$B$8%,\"\")","v":""},{"$f":"IF(ISNUMBER(F9),$E9*'Dairy Wizard'!$B$6%,\"\")","v":""},null,null,"",""]
["Parlour building",{"$f":"IF(Markers!H40=TRUE,\"Yes\",\"No\")","v":"No"},null,{"$f":"IF(B10=\"yes\",(VLOOKUP(VLOOKUP(TRUE,parlourtype,2,FALSE),buildingcosts,2,FALSE)*VLOOKUP(VLOOKUP(TRUE,parlourtype,2,FALSE),parlourconfiguration,5,FALSE))/herd,\"\")","v":""},{"$f":"IF(B10=\"yes\",(VLOOKUP(VLOOKUP(TRUE,parlourtype,2,FALSE),buildingcosts,2,FALSE))*VLOOKUP(VLOOKUP(TRUE,parlourtype,2,FALSE),parlourconfiguration,5,FALSE),\"\")","v":""},{"$f":"IF(ISNUMBER(E10),$E10*'Dairy Wizard'!$B$8%,\"\")","v":""},{"$f":"IF(ISNUMBER(F10),$E10*'Dairy Wizard'!$B$6%,\"\")","v":""},null,null,"",""]
{"$rows_left_out":13}
{"sheet":"Data entry (4)","index":10,"n_rows":75,"n_cols":19,"rows_kept":75,"cut":false,"hidden":false,"merged":[]}
["Slurry Wizard ~ Data entry"]
[]
[]
[]
["Total farmable area",0,"hectares"]
["Telephone STD code","01262"]
["Cows in herd",{"$f":"'Dairy Wizard'!B4","v":0},"cows"]
["Cows in milk",80,"cows"]
["Depreciation buildings",{"$f":"'Dairy Wizard'!B6","v":5},"%"]
["Depreciation machinery",{"$f":"'Dairy Wizard'!B7","v":10},"%"]
{"$rows_left_out":66}
{"sheet":"Livestock","index":11,"n_rows":66,"n_cols":9,"rows_kept":66,"cut":false,"hidden":false,"merged":[]}
["Livestock data entry ~ Enter all livestock below"]
[]
[]
[]
["Livestock ","Age","Liveweight/milk yield","Number","% collected as slurry","Daily excreta","Total collected as slurry","Annual N output kg/year","Total N"]
[{"$nulls":8},"(kg/year)"]
["Cattle"]
["Dairy Cow","After first calf","High (>9000)",null,1,64,{"$f":"D8*E8*F8","v":0},115,{"$f":"SUM(D8*H8)","v":0}]
["Dairy Cow","After first calf","Medium (6000-9000)",null,0.85,53,0,101,0]
["Dairy Cow","After first calf","Low (<6000)",null,1,42,0,77,0]
{"$rows_left_out":57}
{"sheet":"Slurry report","index":12,"n_rows":27,"n_cols":15,"rows_kept":27,"cut":false,"hidden":false,"merged":[]}
["Slurry Report"]
[]
[]
[]
["Cubic metres",null,"Oct","Nov","Dec","Jan","Feb","Mar","Apr","May","Jun","Jul","Aug","Sep","Total"]
["Days",null,31,30,31,31,28,31,30,31,30,31,31,30,{"$f":"SUM(C6:N6)","v":365}]
["Total excreta as slurry",null,{"$f":"(Livestock!$G$60/1000)*C6","v":0},{"$f":"(Livestock!$G$60/1000)*D6","v":0},{"$f":"(Livestock!$G$60/1000)*E6","v":0},{"$f":"(Livestock!$G$60/1000)*F6","v":0},{"$f":"(Livestock!$G$60/1000)*(G6+1)","v":0},{"$f":"(Livestock!$G$60/1000)*H6","v":0},{"$f":"(Livestock!$G$60/1000)*I6","v":0},{"$f":"(Livestock!$G$60/1000)*J6","v":0},{"$f":"(Livestock!$G$60/1000)*K6","v":0},{"$f":"(Livestock!$G$60/1000)*L6","v":0},{"$f":"(Livestock!$G$60/1000)*M6","v":0},{"$f":"(Livestock!$G$60/1000)*N6","v":0},{"$f":"SUM(C7:N7)","v":0}]
["% excreta to slurry store",null,50,100,100,100,100,100,20,20,20,20,20,20]
["Excreta to slurry store",null,{"$f":"C7*C8/100","v":0},0,0,0,0,0,0,0,0,0,0,0,{"$f":"SUM(C9:N9)","v":0}]
["Slurry separated",{"$f":"CONCATENATE('Data entry (4)'!$B$35,IF('Data entry (4)'!$B$35=\"no\",,CONCATENATE(\" / \",'Data entry (4)'!$B$36,\"%\")))","v":"No"},{"$f":"IF($B$10=\"no\",0,(C9+C11+C13+C14+C15)*('Data entry (4)'!$B$36%))","v":0},{"$f":"IF($B$10=\"no\",0,(D9+D11+D13+D14+D15)*('Data entry (4)'!$B$36%))","v":0},{"$f":"IF($B$10=\"no\",0,(E9+E11+E13+E14+E15)*('Data entry (4)'!$B$36%))","v":0},{"$f":"IF($B$10=\"no\",0,(F9+F11+F13+F14+F15)*('Data entry (4)'!$B$36%))","v":0},{"$f":"IF($B$10=\"no\",0,(G9+G11+G13+G14+G15)*('Data entry (4)'!$B$36%))","v":0},{"$f":"IF($B$10=\"no\",0,(H9+H11+H13+H14+H15)*('Data entry (4)'!$B$36%))","v":0},{"$f":"IF($B$10=\"no\",0,(I9+I11+I13+I14+I15)*('Data entry (4)'!$B$36%))","v":0},{"$f":"IF($B$10=\"no\",0,(J9+J11+J13+J14+J15)*('Data entry (4)'!$B$36%))","v":0},{"$f":"IF($B$10=\"no\",0,(K9+K11+K13+K14+K15)*('Data entry (4)'!$B$36%))","v":0},{"$f":"IF($B$10=\"no\",0,(L9+L11+L13+L14+L15)*('Data entry (4)'!$B$36%))","v":0},{"$f":"IF($B$10=\"no\",0,(M9+M11+M13+M14+M15)*('Data entry (4)'!$B$36%))","v":0},{"$f":"IF($B$10=\"no\",0,(N9+N11+N13+N14+N15)*('Data entry (4)'!$B$36%))","v":0},0]
{"$rows_left_out":18}
{"sheet":"Rainfall","index":13,"n_rows":617,"n_cols":15,"rows_kept":617,"cut":false,"hidden":true,"merged":[]}
["MANNER rainfall data"]
[]
["STD ","Jan","Feb","Mar","Apr","May","Jun","Jul","Aug","Sep","Oct","Nov","Dec","Total","Manner total"]
["0113",77,61,67,62,59,61,59,72,71,73,77,78,{"$f":"SUM(B4:M4)","v":817},815]
["0114",92,70,77,69,65,62,54,66,67,74,87,92,875,875]
["0115",53,46,48,48,50,55,48,59,49,50,54,59,619,620]
["0116",53,45,49,50,52,60,47,61,50,50,55,59,631,630]
["0117",85,61,68,55,64,65,61,74,82,83,85,92,875,875]
["0118",69,48,58,49,54,53,43,56,60,63,68,74,695,695]
["01200",131,79,102,78,81,96,94,124,129,147,139,137,1337,1337]
{"$rows_left_out":608}
{"sheet":"Markers","index":14,"n_rows":111,"n_cols":19,"rows_kept":111,"cut":false,"hidden":false,"merged":[[5,15,6,15]]}
[]
[true,"Housing/feeding",{"$nulls":5},true,"Herringbone 1:1",null,"existing yes",true,null,"Men"]
[false,"Housing/feeding",{"$nulls":5},false,"Herringbone 1:2",null,null,"Herringbone 1:2",{"$nulls":4},"Loading",{"$f":"ROUNDUP('Options (2)'!$B$8/VALUE(LEFT(Markers!R8,2)),0)*VLOOKUP(VALUE(LEFT(Markers!R8,2)),loading,3)/60/60/24","v":"00:00:00"}]
[true,"Slurry",{"$nulls":5},false,"Rapid Exit",{"$nulls":8},{"$f":"R15*'Options (2)'!$B$8+R2","v":"00:00:00"}]
[{"$nulls":7},false,"Auto Tandem",{"$nulls":7},"Milking time",{"$f":"((IF(R6=1,R9,R9*0.6)/60/60/24)+R10+R11+R13+R14)*'Options (2)'!$B$8+R3","v":"00:00:00"}]
[{"$nulls":7},false,"Internal Rotary",{"$nulls":6},"Men","1:1 Herringbone",{"$f":"IF(VALUE(LEFT(R$8,2))>(VLOOKUP($Q6,manpower,2,FALSE)),2,1)","v":1}]
[false,"Straw yard",null,null,false,null,null,false,"External Rotary",{"$nulls":7},"1:2 Herringbone",{"$f":"IF(VALUE(LEFT(R$8,2))>(VLOOKUP($Q7,manpower,2,FALSE)),2,1)","v":1}]
[false,"Kennel",false,"Kennel 3 row",null,null,null,false,"AMS",{"$nulls":8},"16/16"]
[false,"Cubicles 2 Row",{"$nulls":4},"Exisiting","New",null,1,2,3,4,"Ex Times","New Times",null,"Cluster attach",{"$f":"+(12/60/60/24)","v":1.3888888888888889E-4}]
[true,"Cubicles 3 Row",{"$nulls":4},3,3,"Foremlik",6.9444444444444404E-5,3.4722222222222222E-5,0,null,{"$f":"HLOOKUP(G10,uddertime,MATCH(I10,$I$9:$I$15,0),0)","v":0},{"$f":"HLOOKUP(H10,uddertime,MATCH(I10,$I$9:$I$15,0),0)","v":0},null,"Automation time",{"$f":"$O$18+$O$21+$O$22","v":1.8518518518518518E-4}]
{"$rows_left_out":102}
{"sheet":"Effect on profit","index":15,"n_rows":21,"n_cols":6,"rows_kept":21,"cut":false,"hidden":true,"merged":[]}
["Partial Budgets"]
[]
[]
["Cows",{"$f":"'Data entry (2)'!B4","v":100}]
["Option","Net capital invested £ total","Increased costs £/annum","Reduced costs £/annum","Effect on profit £/annum","% return on capital"]
["Cubicles v existing straw yard",{"$f":"'Cubicle v straw'!$D$23","v":64400},{"$f":"'Cubicle v straw'!G25","v":21206.666666666664},{"$f":"'Cubicle v straw'!N25","v":18260.333333333332},{"$f":"'Cubicle v straw'!G27","v":-2946.3333333333321},{"$f":"IF('Cubicle v straw'!G28<0,0,'Cubicle v straw'!G28)","v":4.2494824016563338E-3}]
["New cubicle v new straw yard",{"$f":"'New cubicle'!D23-'New cubicle'!K23","v":450},{"$f":"'New cubicle'!G25","v":27936.666666666664},{"$f":"'New cubicle'!N25","v":31385.333333333332},{"$f":"'New cubicle'!G27","v":3448.6666666666679},{"$f":"IF('New cubicle'!G28<0,0,'New cubicle'!G28)","v":7.6185775752973944E-2}]
["Mat + straw v concrete + straw",{"$f":"Mat!D21-Mat!K21","v":3000},{"$f":"Mat!G23","v":2850},{"$f":"Mat!N23","v":4000},{"$f":"Mat!G25","v":1150},{"$f":"IF(Mat!G26<0,0,Mat!G26)","v":0.43333333333333335}]
["Mattress + straw v concrete + straw",{"$f":"Mattress!D21-Mattress!K21","v":6000},{"$f":"Mattress!G23","v":3300},{"$f":"Mattress!N23","v":4000},{"$f":"Mattress!G25","v":700},{"$f":"IF(Mattress!G26<0,0,Mattress!G26)","v":0.16666666666666666}]
["Sand v concrete + straw",{"$f":"Sand!D21-Sand!K21","v":1000},{"$f":"Sand!G23","v":4850},{"$f":"Sand!N23","v":4550},{"$f":"Sand!G25","v":-300},{"$f":"IF(Sand!G26<0,0,Sand!G26)","v":0}]
{"$rows_left_out":12}
{"sheet":"Data entry (2)","index":16,"n_rows":22,"n_cols":3,"rows_kept":22,"cut":false,"hidden":true,"merged":[]}
["MDC dairy cow housing model"]
["Data entry"]
[]
["Cow number",{"$f":"'Data entry'!B6","v":100},"cows"]
["Annual yield/cow",{"$f":"'Data entry'!B7","v":7000},"litres"]
["Yield/cow/day",{"$f":"'Data entry'!B21","v":25},"litres"]
["Butterfat price",{"$f":"'Data entry'!B22","v":1.5},"p/1%"]
["Milk price",{"$f":"'Data entry'!B23","v":18.5},"p/litre"]
["Quota",{"$f":"'Data entry'!B25","v":0.1},"p/litre"]
["Milking diet cost",{"$f":"'Data entry'!B24","v":200},"p/cow/day"]
{"$rows_left_out":13}
{"sheet":"Operating costs (2)","index":17,"n_rows":88,"n_cols":7,"rows_kept":88,"cut":false,"hidden":false,"merged":[]}
["MDC dairy cow housing model"]
["OPERATING COSTS"]
[]
["BEDDING REQUIREMENTS"]
[]
["Straw unchopped yard",{"$f":"'Operating costs'!B6","v":15},"kg/cow/day"]
["Straw unchopped cubicle",{"$f":"'Operating costs'!B8","v":7},"kg/cow/day"]
["Straw chopped cubicle",{"$f":"'Operating costs'!B9","v":5},"kg/cow/day"]
["Straw chopped cubicle/mat",{"$f":"'Operating costs'!B10","v":3},"kg/cow/day"]
["Sawdust cubicle",{"$f":"'Operating costs'!B11","v":1},"kg/cow/day"]
{"$rows_left_out":79}
{"sheet":"Capital costs (2)","index":18,"n_rows":55,"n_cols":5,"rows_kept":55,"cut":false,"hidden":true,"merged":[]}
["MDC dairy cow housing model"]
[]
["CAPITAL COSTS"]
[]
["Housing only","Cost £/sq.metre","Sq.metre/cow","£/cow"]
["Straw yard",{"$f":"'Capital costs'!B6","v":125},{"$f":"'Capital costs'!C6","v":10.5},{"$f":"B6*C6","v":1312.5}]
["Kennel",{"$f":"'Capital costs'!B7","v":95},{"$f":"'Capital costs'!C7","v":4.5999999999999996},{"$f":"B7*C7","v":436.99999999999994},"Check - quote is £750/cow excluding concrete & electrics"]
["Cubicle excl. bed",{"$f":"'Capital costs'!B8","v":175},{"$f":"'Capital costs'!C8","v":4.5999999999999996},733,"£50 excluded for concrete bed - see below"]
["Cubicle with slats",{"$f":"'Capital costs'!B9","v":355},{"$f":"'Capital costs'!C9","v":4.5999999999999996},1292,"£50 added for division"]
[]
{"$rows_left_out":46}
{"sheet":"Cubicle v straw","index":19,"n_rows":28,"n_cols":14,"rows_kept":28,"cut":false,"hidden":true,"merged":[]}
["MDC dairy cow housing model"]
[]
[]
[]
[]
[]
["LOSSES",{"$nulls":6},"GAINS"]
["Reduced Income",{"$nulls":5},"£/annum","Increased Income",{"$nulls":5},"£/annum"]
[]
[]
{"$rows_left_out":19}
{"sheet":"New cubicle","index":20,"n_rows":28,"n_cols":14,"rows_kept":28,"cut":false,"hidden":true,"merged":[]}
["MDC dairy cow housing model"]
[]
[]
[]
[]
[]
["LOSSES",{"$nulls":6},"GAINS"]
["Reduced Income",{"$nulls":5},"£/annum","Increased Income",{"$nulls":5},"£/annum"]
[]
[]
{"$rows_left_out":19}
{"sheet":"Cubicle + slats","index":21,"n_rows":28,"n_cols":14,"rows_kept":28,"cut":false,"hidden":true,"merged":[]}
["MDC dairy cow housing model"]
[]
[]
[]
[]
[]
["LOSSES",{"$nulls":6},"GAINS"]
["Reduced Income",{"$nulls":5},"£/annum","Increased Income",{"$nulls":5},"£/annum"]
[]
[]
{"$rows_left_out":19}
{"sheet":"Scrapers","index":22,"n_rows":26,"n_cols":14,"rows_kept":26,"cut":false,"hidden":true,"merged":[]}
["MDC dairy cow housing model"]
[]
[]
[]
[]
[]
["LOSSES",{"$nulls":6},"GAINS"]
["Reduced Income",{"$nulls":5},"£/annum","Increased Income",{"$nulls":5},"£/annum"]
[]
[]
{"$rows_left_out":17}
{"sheet":"Flushing","index":23,"n_rows":26,"n_cols":14,"rows_kept":26,"cut":false,"hidden":true,"merged":[]}
["MDC dairy cow housing model"]
[]
[]
[]
[]
[]
["LOSSES",{"$nulls":6},"GAINS"]
["Reduced Income",{"$nulls":5},"£/annum","Increased Income",{"$nulls":5},"£/annum"]
[]
[]
{"$rows_left_out":17}
{"sheet":"Light","index":24,"n_rows":28,"n_cols":14,"rows_kept":28,"cut":false,"hidden":true,"merged":[]}
["MDC dairy cow housing model"]
[]
[]
[]
[]
[]
["LOSSES",{"$nulls":6},"GAINS"]
["Reduced Income","Cows","Units","Days","Total","£/unit","£/annum","Increased Income","Cows","Units","Days","Total","£/unit","£/annum"]
["Butterfat ",{"$f":"'Data entry (2)'!$B$4","v":100},{"$f":"'Data entry (2)'!B6","v":25},{"$f":"'Data entry (2)'!B11","v":200},{"$f":"B9*C9*D9","v":500000},{"$f":"'Operating costs (2)'!B66*'Data entry (2)'!B7/100","v":2.3999999999999998E-3},{"$f":"E9*F9","v":1200},"Milk",{"$f":"'Data entry (2)'!$B$4","v":100},{"$f":"'Data entry (2)'!B6*'Operating costs (2)'!B64/100","v":2},{"$f":"'Data entry (2)'!B11","v":200},{"$f":"I9*J9*K9","v":40000},{"$f":"('Data entry (2)'!B8)/100","v":0.185},{"$f":"L9*M9","v":7400}]
[]
{"$rows_left_out":19}
{"sheet":"Sand","index":25,"n_rows":26,"n_cols":14,"rows_kept":26,"cut":false,"hidden":true,"merged":[]}
["MDC dairy cow housing model"]
[]
[]
[]
[]
[]
["LOSSES",{"$nulls":6},"GAINS"]
["Reduced Income",{"$nulls":5},"£/annum","Increased Income",{"$nulls":5},"£/annum"]
[]
[]
{"$rows_left_out":17}
{"sheet":"Mattress","index":26,"n_rows":26,"n_cols":14,"rows_kept":26,"cut":false,"hidden":true,"merged":[]}
["MDC dairy cow housing model"]
[]
[]
[]
[]
[]
["LOSSES",{"$nulls":6},"GAINS"]
["Reduced Income",{"$nulls":5},"£/annum","Increased Income",{"$nulls":5},"£/annum"]
[]
[]
{"$rows_left_out":17}
{"sheet":"Mat","index":27,"n_rows":26,"n_cols":14,"rows_kept":26,"cut":false,"hidden":true,"merged":[]}
["MDC dairy cow housing model"]
[]
[]
[]
[]
[]
["LOSSES",{"$nulls":6},"GAINS"]
["Reduced Income",{"$nulls":5},"£/annum","Increased Income",{"$nulls":5},"£/annum"]
[]
[]
{"$rows_left_out":16}